Reaction Details
TargetAcetylcholinesterase
LigandBDBM50421636
Substrate/Competitorn/a
Meas. Tech.ChEBML_29848
IC50 15849±n/a nM
Citation Zaheer-ul-Haq, naWellenzohn, BTonmunphean, SKhalid, AChoudhary, MIRode, BM 3D-QSAR studies on natural acetylcholinesterase inhibitors of Sarcococca saligna by comparative molecular field analysis (CoMFA). Bioorg Med Chem Lett13:4375-80 (2003) Acetylcholinesterase
Name:Acetylcholinesterase
Type:Enzyme
Mol. Mass.:67792.70
Organism:Homo sapiens (Human)
Description:P22303
Residue:614
BDBM50421636
NameBDBM50421636
Synonyms:CHEMBL139424
TypeSmall organic molecule
Emp. Form.C28H46N2O2
Mol. Mass.442.677
SMILESC\C=C(/C)C(=O)N[C@@H]1C=C2CC[C@H]3[C@@H]4CC[C@H]([C@H](C)N(C)C)[C@@]4(C)CC[C@@H]3[C@@]2(C)C[C@@H]1O