Reaction Details
TargetAcetylcholinesterase
LigandBDBM50412078
Substrate/Competitorn/a
Meas. Tech.ChEBML_29848
IC50 28840±n/a nM
Citation Zaheer-ul-Haq, naWellenzohn, BTonmunphean, SKhalid, AChoudhary, MIRode, BM 3D-QSAR studies on natural acetylcholinesterase inhibitors of Sarcococca saligna by comparative molecular field analysis (CoMFA). Bioorg Med Chem Lett13:4375-80 (2003) Acetylcholinesterase
Name:Acetylcholinesterase
Type:Enzyme
Mol. Mass.:67792.70
Organism:Homo sapiens (Human)
Description:P22303
Residue:614
BDBM50412078
NameBDBM50412078
Synonyms:EPIPACHYSAMINE D
TypeSmall organic molecule
Emp. Form.C30H46N2O
Mol. Mass.450.699
SMILESC[C@@H]([C@H]1CC[C@H]2[C@@H]3CC[C@H]4C[C@H](CC[C@]4(C)[C@H]3CC[C@]12C)NC(=O)c1ccccc1)N(C)C