Reaction Details
TargetBeta-2 adrenergic receptor
LigandBDBM50241366
Substrate/Competitorn/a
Meas. Tech.ChEMBL_37826 (CHEMBL653458)
Kd 44±n/a nM
Citation IJzerman, APAué, GHBultsma, TLinschoten, MRTimmerman, H Quantitative evaluation of the beta 2-adrenoceptor affinity of phenoxypropanolamines and phenylethanolamines. J Med Chem28:1328-34 (1985) Beta-2 adrenergic receptor
Name:Beta-2 adrenergic receptor
Type:Enzyme Catalytic Domain
Mol. Mass.:47141.18
Organism:BOVINE
Description:adrenergic Beta ADRB2 BOVINE::Q28044
Residue:418
BDBM50241366
NameBDBM50241366
Synonyms:(S)-1-(isopropylamino)-3-(m-tolyloxy)propan-2-ol CHEMBL252319
TypeSmall organic molecule
Emp. Form.C13H21NO2
Mol. Mass.223.3113
SMILESCC(C)NC[C@H](O)COc1cccc(C)c1