Reaction Details
TargetBeta-2 adrenergic receptor
LigandBDBM25762
Substrate/Competitorn/a
Meas. Tech.ChEBML_37826
Kd 580±n/a nM
Citation IJzerman, APAué, GHBultsma, TLinschoten, MRTimmerman, H Quantitative evaluation of the beta 2-adrenoceptor affinity of phenoxypropanolamines and phenylethanolamines. J Med Chem28:1328-34 (1985) Beta-2 adrenergic receptor
Name:Beta-2 adrenergic receptor
Type:Enzyme Catalytic Domain
Mol. Mass.:47141.18
Organism:BOVINE
Description:adrenergic Beta ADRB2 BOVINE::Q28044
Residue:418
BDBM25762
NameBDBM25762
Synonyms:CHEMBL471 SOTALOL HYDROCHLORIDE Sotalol,(+) cid_66245
TypeSmall organic molecule
Emp. Form.C12H20N2O3S
Mol. Mass.272.364
SMILESCC(C)NCC(O)c1ccc(NS(C)(=O)=O)cc1