Reaction Details
Target5-hydroxytryptamine receptor 4
LigandBDBM82505
Substrate/Competitorn/a
Meas. Tech.ChEMBL_77009 (CHEMBL696086)
IC50 0.10±n/a nM
Citation Gaster, LMJennings, AJJoiner, GFKing, FDMulholland, KRRahman, SKStarr, SWyman, PAWardle, KAEllis, ES (1-Butyl-4-piperidinyl)methyl 8-amino-7-chloro-1,4-benzodioxane-5-carboxylate hydrochloride: a highly potent and selective 5-HT4 receptor antagonist derived from metoclopramide. J Med Chem36:4121-3 (1994) 5-hydroxytryptamine receptor 4
Name:5-hydroxytryptamine receptor 4
Type:Enzyme Catalytic Domain
Mol. Mass.:43735.29
Organism:GUINEA PIG
Description:5-HT4 HTR4 GUINEA PIG::O70528
Residue:388
BDBM82505
NameBDBM82505
Synonyms:CAS_121881 SB204070
TypeSmall organic molecule
Emp. Form.C19H27ClN2O4
Mol. Mass.382.882
SMILESCCCCN1CCC(COC(=O)c2cc(Cl)c(N)c3OCCOc23)CC1