Reaction Details
TargetProthrombin
LigandBDBM50422375
Substrate/Competitorn/a
Meas. Tech.ChEMBL_208706 (CHEMBL873469)
IC50 25±n/a nM
Citation Linusson, AGottfries, JOlsson, TOrnskov, EFolestad, SNordén, BWold, S Statistical molecular design, parallel synthesis, and biological evaluation of a library of thrombin inhibitors. J Med Chem44:3424-39 (2001) Prothrombin
Name:Prothrombin
Type:Protein
Mol. Mass.:70029.57
Organism:Homo sapiens (Human)
Description:P00734
Residue:622
BDBM50422375
NameBDBM50422375
Synonyms:CHEMBL116616
TypeSmall organic molecule
Emp. Form.C23H24N2O4S
Mol. Mass.424.513
SMILESCCc1cc(OCCc2ccc(cc2)C(N)=N)cc(OS(=O)(=O)c2ccccc2)c1