Reaction Details
TargetProthrombin
LigandBDBM50422376
Substrate/Competitorn/a
Meas. Tech.ChEMBL_208706 (CHEMBL873469)
IC50 56±n/a nM
Citation Linusson, AGottfries, JOlsson, TOrnskov, EFolestad, SNordén, BWold, S Statistical molecular design, parallel synthesis, and biological evaluation of a library of thrombin inhibitors. J Med Chem44:3424-39 (2001) Prothrombin
Name:Prothrombin
Type:Protein
Mol. Mass.:70029.57
Organism:Homo sapiens (Human)
Description:P00734
Residue:622
BDBM50422376
NameBDBM50422376
Synonyms:CHEMBL116149
TypeSmall organic molecule
Emp. Form.C22H20Cl2N2O5S
Mol. Mass.495.376
SMILESCOc1c(Cl)cc(Cl)cc1S(=O)(=O)Oc1cccc(OCCc2ccc(cc2)C(N)=N)c1