Reaction Details
TargetFarnesyl pyrophosphate synthase
LigandBDBM50422443
Substrate/Competitorn/a
Meas. Tech.ChEMBL_194806 (CHEMBL799889)
IC50 600±n/a nM
Citation Kotsikorou, EOldfield, E A quantitative structure-activity relationship and pharmacophore modeling investigation of aryl-X and heterocyclic bisphosphonates as bone resorption agents. J Med Chem46:2932-44 (2003) 
 
Farnesyl pyrophosphate synthase
Name:Farnesyl pyrophosphate synthase
Type:Enzyme
Mol. Mass.:48272.89
Organism:Homo sapiens (Human)
Description:P14324
Residue:419
BDBM50422443
NameBDBM50422443
Synonyms:CHEMBL327756
TypeSmall organic molecule
Emp. Form.C10H13N3O6P2
Mol. Mass.333.1742
SMILESOP(O)(=O)C(Nc1nccn1-c1ccccc1)P(O)(O)=O