Reaction Details
TargetFarnesyl pyrophosphate synthase
LigandBDBM50422447
Substrate/Competitorn/a
Meas. Tech.ChEMBL_194806 (CHEMBL799889)
IC50 246±n/a nM
Citation Kotsikorou, EOldfield, E A quantitative structure-activity relationship and pharmacophore modeling investigation of aryl-X and heterocyclic bisphosphonates as bone resorption agents. J Med Chem46:2932-44 (2003) 
 
Farnesyl pyrophosphate synthase
Name:Farnesyl pyrophosphate synthase
Type:Enzyme
Mol. Mass.:48272.89
Organism:Homo sapiens (Human)
Description:P14324
Residue:419
BDBM50422447
NameBDBM50422447
Synonyms:CHEMBL101716
TypeSmall organic molecule
Emp. Form.C14H25NO8P2
Mol. Mass.397.2977
SMILESCN(CCCOc1ccccc1)CCCC(O)(P(O)(O)=O)P(O)(O)=O