Reaction Details
TargetFarnesyl pyrophosphate synthase
LigandBDBM50422457
Substrate/Competitorn/a
Meas. Tech.ChEMBL_194806 (CHEMBL799889)
IC50 1.7±n/a nM
Citation Kotsikorou, EOldfield, E A quantitative structure-activity relationship and pharmacophore modeling investigation of aryl-X and heterocyclic bisphosphonates as bone resorption agents. J Med Chem46:2932-44 (2003) 
 
Farnesyl pyrophosphate synthase
Name:Farnesyl pyrophosphate synthase
Type:Enzyme
Mol. Mass.:48272.89
Organism:Homo sapiens (Human)
Description:P14324
Residue:419
BDBM50422457
NameBDBM50422457
Synonyms:CHEMBL101230
TypeSmall organic molecule
Emp. Form.C13H22ClNO7P2
Mol. Mass.401.717
SMILESCN(CCCc1ccc(Cl)cc1)CCC(O)(P(O)(O)=O)P(O)(O)=O