Reaction Details
TargetFarnesyl pyrophosphate synthase
LigandBDBM50135841
Substrate/Competitorn/a
Meas. Tech.ChEMBL_194806 (CHEMBL799889)
IC50 347±n/a nM
Citation Kotsikorou, EOldfield, E A quantitative structure-activity relationship and pharmacophore modeling investigation of aryl-X and heterocyclic bisphosphonates as bone resorption agents. J Med Chem46:2932-44 (2003) 
 
Farnesyl pyrophosphate synthase
Name:Farnesyl pyrophosphate synthase
Type:Enzyme
Mol. Mass.:48272.89
Organism:Homo sapiens (Human)
Description:P14324
Residue:419
BDBM50135841
NameBDBM50135841
Synonyms:(4-methylthiazol-2-ylamino)methylenediphosphonic acid CHEMBL293116 | [(4-Methyl-thiazol-2-ylamino)-phosphono-methyl]-phosphonic acid
TypeSmall organic molecule
Emp. Form.C5H10N2O6P2S
Mol. Mass.288.155
SMILESCc1csc(NC(P(O)(O)=O)P(O)(O)=O)n1