Reaction Details
TargetFarnesyl pyrophosphate synthase
LigandBDBM50422458
Substrate/Competitorn/a
Meas. Tech.ChEMBL_194806 (CHEMBL799889)
IC50 4.3±n/a nM
Citation Kotsikorou, EOldfield, E A quantitative structure-activity relationship and pharmacophore modeling investigation of aryl-X and heterocyclic bisphosphonates as bone resorption agents. J Med Chem46:2932-44 (2003) 
 
Farnesyl pyrophosphate synthase
Name:Farnesyl pyrophosphate synthase
Type:Enzyme
Mol. Mass.:48272.89
Organism:Homo sapiens (Human)
Description:P14324
Residue:419
BDBM50422458
NameBDBM50422458
Synonyms:CHEMBL100835
TypeSmall organic molecule
Emp. Form.C14H25NO8P2
Mol. Mass.397.2977
SMILESCN(CCCOc1cccc(C)c1)CCC(O)(P(O)(O)=O)P(O)(O)=O