Reaction Details
TargetFarnesyl pyrophosphate synthase
LigandBDBM50422465
Substrate/Competitorn/a
Meas. Tech.ChEMBL_194806 (CHEMBL799889)
IC50 1175±n/a nM
Citation Kotsikorou, EOldfield, E A quantitative structure-activity relationship and pharmacophore modeling investigation of aryl-X and heterocyclic bisphosphonates as bone resorption agents. J Med Chem46:2932-44 (2003) 
 
Farnesyl pyrophosphate synthase
Name:Farnesyl pyrophosphate synthase
Type:Enzyme
Mol. Mass.:48272.89
Organism:Homo sapiens (Human)
Description:P14324
Residue:419
BDBM50422465
NameBDBM50422465
Synonyms:CHEMBL97920
TypeSmall organic molecule
Emp. Form.C16H29NO8P2
Mol. Mass.425.3509
SMILESCCCCN(CCCOc1ccccc1)CCC(O)(P(O)(O)=O)P(O)(O)=O