Reaction Details
TargetFarnesyl pyrophosphate synthase
LigandBDBM50422466
Substrate/Competitorn/a
Meas. Tech.ChEMBL_194806 (CHEMBL799889)
IC50 185±n/a nM
Citation Kotsikorou, EOldfield, E A quantitative structure-activity relationship and pharmacophore modeling investigation of aryl-X and heterocyclic bisphosphonates as bone resorption agents. J Med Chem46:2932-44 (2003) 
 
Farnesyl pyrophosphate synthase
Name:Farnesyl pyrophosphate synthase
Type:Enzyme
Mol. Mass.:48272.89
Organism:Homo sapiens (Human)
Description:P14324
Residue:419
BDBM50422466
NameBDBM50422466
Synonyms:CHEMBL318504
TypeSmall organic molecule
Emp. Form.C11H15N3O6P2
Mol. Mass.347.2008
SMILESOP(O)(=O)C(Nc1nccn1Cc1ccccc1)P(O)(O)=O