Reaction Details
TargetFarnesyl pyrophosphate synthase
LigandBDBM50422468
Substrate/Competitorn/a
Meas. Tech.ChEMBL_194806 (CHEMBL799889)
IC50 65±n/a nM
Citation Kotsikorou, EOldfield, E A quantitative structure-activity relationship and pharmacophore modeling investigation of aryl-X and heterocyclic bisphosphonates as bone resorption agents. J Med Chem46:2932-44 (2003) 
 
Farnesyl pyrophosphate synthase
Name:Farnesyl pyrophosphate synthase
Type:Enzyme
Mol. Mass.:48272.89
Organism:Homo sapiens (Human)
Description:P14324
Residue:419
BDBM50422468
NameBDBM50422468
Synonyms:CHEMBL98787
TypeSmall organic molecule
Emp. Form.C12H14N2O8P2
Mol. Mass.376.1957
SMILESOC(Cc1nccn1C(=O)c1ccccc1)(P(O)(O)=O)P(O)(O)=O