Reaction Details
TargetReverse transcriptase/RNaseH
LigandBDBM1780
Substrate/Competitorn/a
Meas. Tech.ChEMBL_307251 (CHEMBL829157)
IC50 14125±n/a nM
Citation Sciabola, SCarosati, EBaroni, MMannhold, R Comparison of ligand-based and structure-based 3D-QSAR approaches: a case study on (aryl-)bridged 2-aminobenzonitriles inhibiting HIV-1 reverse transcriptase. J Med Chem48:3756-67 (2005) 
 
Reverse transcriptase/RNaseH
Name:Reverse transcriptase/RNaseH
Type:PROTEIN
Mol. Mass.:65229.15
Organism:Human immunodeficiency virus 1
Description:ChEMBL_1473730
Residue:566
BDBM1780
NameBDBM1780
Synonyms:1-nitro-2-[(2-nitrobenzene)sulfonyl]benzene | 2-Amino-6-arylthiobenzonitrile deriv. 4b
TypeSmall organic molecule
Emp. Form.C12H8N2O6S
Mol. Mass.308.267
SMILES[O-][N+](=O)c1ccccc1S(=O)(=O)c1ccccc1[N+]([O-])=O