Reaction Details
TargetReverse transcriptase/RNaseH
LigandBDBM1733
Substrate/Competitorn/a
Meas. Tech.ChEMBL_307251 (CHEMBL829157)
IC50 1514±n/a nM
Citation Sciabola, SCarosati, EBaroni, MMannhold, R Comparison of ligand-based and structure-based 3D-QSAR approaches: a case study on (aryl-)bridged 2-aminobenzonitriles inhibiting HIV-1 reverse transcriptase. J Med Chem48:3756-67 (2005) 
 
Reverse transcriptase/RNaseH
Name:Reverse transcriptase/RNaseH
Type:PROTEIN
Mol. Mass.:65229.15
Organism:Human immunodeficiency virus 1
Description:ChEMBL_1473730
Residue:566
BDBM1733
NameBDBM1733
Synonyms:2-Amino-6-arylthiobenzonitrile deriv. 1c | 2-amino-6-[(3-methoxyphenyl)sulfanyl]benzonitrile
TypeSmall organic molecule
Emp. Form.C14H12N2OS
Mol. Mass.256.323
SMILESCOc1cccc(Sc2cccc(N)c2C#N)c1