Reaction Details
TargetP2X purinoceptor 2
LigandBDBM50422739
Substrate/Competitorn/a
Meas. Tech.ChEMBL_321677 (CHEMBL872172)
IC50 138±n/a nM
Citation Ullmann, HMeis, SHongwiset, DMarzian, CWiese, MNickel, PCommuni, DBoeynaems, JMWolf, CHausmann, RSchmalzing, GKassack, MU Synthesis and structure-activity relationships of suramin-derived P2Y11 receptor antagonists with nanomolar potency. J Med Chem48:7040-8 (2005) 
 
P2X purinoceptor 2
Name:P2X purinoceptor 2
Type:Enzyme Catalytic Domain
Mol. Mass.:52625.55
Organism:RAT
Description:Purinergic, P2X2 0 RAT::P49653
Residue:472
BDBM50422739
NameBDBM50422739
Synonyms:CHEMBL413145
TypeSmall organic molecule
Emp. Form.C49H28F2N6O23S6
Mol. Mass.1299.163
SMILES[O-]S(=O)(=O)c1cc(c2c(NC(=O)c3ccc(F)c(NC(=O)c4cccc(NC(=O)Nc5cccc(c5)C(=O)Nc5cc(ccc5F)C(=O)Nc5ccc(c6cc(cc(c56)S([O-])(=O)=O)S([O-])(=O)=O)S([O-])(=O)=O)c4)c3)ccc(c2c1)S([O-])(=O)=O)S([O-])(=O)=O