Reaction Details
TargetCorticotropin-releasing factor receptor 1
LigandBDBM50423374
Substrate/Competitorn/a
Meas. Tech.ChEMBL_457005 (CHEMBL923348)
IC50 40±n/a nM
Citation Gentile, GDi Fabio, RPavone, FSabbatini, FMSt-Denis, YZampori, MGVitulli, GWorby, A Novel substituted tetrahydrotriazaacenaphthylene derivatives as potent CRF1 receptor antagonists. Bioorg Med Chem Lett17:5218-21 (2007) 
 
Corticotropin-releasing factor receptor 1
Name:Corticotropin-releasing factor receptor 1
Type:Enzyme
Mol. Mass.:50744.31
Organism:Homo sapiens (Human)
Description:P34998
Residue:444
BDBM50423374
NameBDBM50423374
Synonyms:CHEMBL251551
TypeSmall organic molecule
Emp. Form.C23H26N4O
Mol. Mass.374.4787
SMILESCCC(COC)n1cc2CCN(c3ccc(cc3C)C#N)c3nc(C)cc1c23