Reaction Details
TargetCorticotropin-releasing factor receptor 1
LigandBDBM50423385
Substrate/Competitorn/a
Meas. Tech.ChEMBL_457005 (CHEMBL923348)
IC50 13±n/a nM
Citation Gentile, GDi Fabio, RPavone, FSabbatini, FMSt-Denis, YZampori, MGVitulli, GWorby, A Novel substituted tetrahydrotriazaacenaphthylene derivatives as potent CRF1 receptor antagonists. Bioorg Med Chem Lett17:5218-21 (2007) 
 
Corticotropin-releasing factor receptor 1
Name:Corticotropin-releasing factor receptor 1
Type:Enzyme
Mol. Mass.:50744.31
Organism:Homo sapiens (Human)
Description:P34998
Residue:444
BDBM50423385
NameBDBM50423385
Synonyms:CHEMBL248962
TypeSmall organic molecule
Emp. Form.C23H29N3O
Mol. Mass.363.4959
SMILESCCC(CC)n1cc2CCN(c3ccc(OC)cc3C)c3nc(C)cc1c23