Reaction Details
TargetMuscarinic acetylcholine receptor M1
LigandBDBM50003369
Substrate/Competitorn/a
Meas. Tech.ChEMBL_469043 (CHEMBL929995)
IC50 52±n/a nM
Citation Kane, BEGrant, MKEl-Fakahany, EEFerguson, DM Synthesis and evaluation of xanomeline analogs--probing the wash-resistant phenomenon at the M1 muscarinic acetylcholine receptor. Bioorg Med Chem16:1376-92 (2008) 
 
Muscarinic acetylcholine receptor M1
Name:Muscarinic acetylcholine receptor M1
Type:Protein
Mol. Mass.:51442.54
Organism:Homo sapiens (Human)
Description:P11229
Residue:460
BDBM50003369
NameBDBM50003369
Synonyms:1-Methyl-5-(4-propoxy-[1,2,5]thiadiazol-3-yl)-1,2,3,6-tetrahydro-pyridine 1-methyl-5-(4-propoxy-1,2,5-thiadiazol-3-yl)-1,2,3,6-tetrahydropyridine CHEMBL308803
TypeSmall organic molecule
Emp. Form.C11H17N3OS
Mol. Mass.239.337
SMILESCCCOc1nsnc1C1=CCCN(C)C1