Reaction Details
TargetIntegrin alpha-5/beta-1
LigandBDBM50423737
Substrate/Competitorn/a
Meas. Tech.ChEMBL_603785 (CHEMBL1042923)
IC50 1.6±n/a nM
Citation Zischinsky, GOsterkamp, FVossmeyer, DZahn, GScharn, DZwintscher, AStragies, R SAR of N-phenyl piperidine based oral integrin alpha5beta1 antagonists. Bioorg Med Chem Lett20:65-8 (2010) 
 
Integrin alpha-5/beta-1
Name:Integrin alpha-5/beta-1
Type:Enzyme
Mol. Mass.:n/a
Description:n/a
Components:This complex has 2 components.
Component 1
Name:Integrin alpha-5
Synonyms:CD49 antigen-like family member E FNRA Fibronectin receptor subunit alpha ITGA5 Integrin alpha-F | VLA-5
Type:Single-pass type I membrane protein
Mol. Mass.:114523.00
Organism:Homo sapiens (Human)
Description:n/a
Residue:1049
Component 2
Name:Integrin beta-1
Synonyms:CD_antigen=CD29 Fibronectin receptor beta GPIIA ITGB1 MDF2 | MSK12
Type:Enzyme
Mol. Mass.:88400.38
Organism:Homo sapiens (Human)
Description:P05556
Residue:798
BDBM50423737
NameBDBM50423737
Synonyms:CHEMBL591544
TypeSmall organic molecule
Emp. Form.C29H34N4O3
Mol. Mass.486.6053
SMILESCc1cccc(C)c1C(=O)NC(Cc1ccc(cc1)N1CCC(CNc2ccccn2)CC1)C(O)=O