Reaction Details
TargetAdenosine receptor A3
LigandBDBM50423866
Substrate/Competitorn/a
Meas. Tech.ChEMBL_817485 (CHEMBL2027708)
Kd 17±n/a nM
Citation Vernall, AJStoddart, LABriddon, SJHill, SJKellam, B Highly potent and selective fluorescent antagonists of the human adenosine A3 receptor based on the 1,2,4-triazolo[4,3-a]quinoxalin-1-one scaffold. J Med Chem55:1771-82 (2012) 
 
Adenosine receptor A3
Name:Adenosine receptor A3
Type:G Protein-Coupled Receptor (GPCR)
Mol. Mass.:36197.32
Organism:Homo sapiens (Human)
Description:P0DMS8
Residue:318
BDBM50423866
NameBDBM50423866
Synonyms:CHEMBL2024148
TypeSmall organic molecule
Emp. Form.C57H61BF2N10O7S
Mol. Mass.1079.03
SMILESCOc1ccc(cc1)-n1nc2c(NC(=O)CCC(=O)NCCCCCCCCNC(=O)CCCCCNC(=O)COc3ccc([CH+]\C=c4\ccc5=Cc6ccc(-c7cccs7)n6[B-](F)(F)n45)cc3)nc3ccccc3n2c1=O