Reaction Details
TargetXanthine dehydrogenase/oxidase
LigandBDBM50423926
Substrate/Competitorn/a
Meas. Tech.ChEMBL_935552 (CHEMBL2320088)
IC50 46600±n/a nM
Citation Mandawad, GGDawane, BSBeedkar, SDKhobragade, CNYemul, OS Trisubstituted thiophene analogues of 1-thiazolyl-2-pyrazoline, super oxidase inhibitors and free radical scavengers. Bioorg Med Chem21:365-72 (2012) 
 
Xanthine dehydrogenase/oxidase
Name:Xanthine dehydrogenase/oxidase
Type:PROTEIN
Mol. Mass.:146252.77
Organism:Rattus norvegicus
Description:ChEMBL_1296864
Residue:1331
BDBM50423926
NameBDBM50423926
Synonyms:CHEMBL2313037
TypeSmall organic molecule
Emp. Form.C29H20Cl2FN3S3
Mol. Mass.596.589
SMILESFc1ccc(cc1)C1CC(=NN1c1nc(cs1)-c1ccc(Cl)cc1)c1cc(Cl)sc1SCc1ccccc1