Reaction Details
TargetXanthine dehydrogenase/oxidase
LigandBDBM50423930
Substrate/Competitorn/a
Meas. Tech.ChEMBL_935552 (CHEMBL2320088)
IC50 36000±n/a nM
Citation Mandawad, GGDawane, BSBeedkar, SDKhobragade, CNYemul, OS Trisubstituted thiophene analogues of 1-thiazolyl-2-pyrazoline, super oxidase inhibitors and free radical scavengers. Bioorg Med Chem21:365-72 (2012) 
 
Xanthine dehydrogenase/oxidase
Name:Xanthine dehydrogenase/oxidase
Type:PROTEIN
Mol. Mass.:146252.77
Organism:Rattus norvegicus
Description:ChEMBL_1296864
Residue:1331
BDBM50423930
NameBDBM50423930
Synonyms:CHEMBL2313033
TypeSmall organic molecule
Emp. Form.C22H13Cl4N3S2
Mol. Mass.525.301
SMILESClc1cc(C2=NN(C(C2)c2ccc(Cl)cc2)c2nc(cs2)-c2ccc(Cl)cc2)c(Cl)s1