Reaction Details
TargetCyclin-T1/Cyclin-dependent kinase 9
LigandBDBM50425007
Substrate/Competitorn/a
Meas. Tech.ChEMBL_936301 (CHEMBL2320999)
Ki 8±n/a nM
Citation Hole, AJBaumli, SShao, HShi, SHuang, SPepper, CFischer, PMWang, SEndicott, JANoble, ME Comparative structural and functional studies of 4-(thiazol-5-yl)-2-(phenylamino)pyrimidine-5-carbonitrile CDK9 inhibitors suggest the basis for isotype selectivity. J Med Chem56:660-70 (2013) 
 
Cyclin-T1/Cyclin-dependent kinase 9
Name:Cyclin-T1/Cyclin-dependent kinase 9
Type:Protein Complex
Mol. Mass.:n/a
Description:n/a
Components:This complex has 2 components.
Component 1
Name:Cyclin-T1
Synonyms:CCNT1 CycT Cyclin T Cyclin-T
Type:Enzyme Subunit
Mol. Mass.:80712.40
Organism:Homo sapiens (Human)
Description:n/a
Residue:726
Component 2
Name:Cyclin-dependent kinase 9
Synonyms:C-2K CDK9 Cell division cycle 2-like protein kinase 4 Cyclin-Dependent Kinase 9 (CDK9) Serine/threonine-protein kinase PITALRE Tat-associated kinase complex catalytic subunit
Type:Enzyme Subunit
Mol. Mass.:42789.13
Organism:Homo sapiens (Human)
Description:n/a
Residue:372
BDBM50425007
NameBDBM50425007
Synonyms:CHEMBL2312186
TypeSmall organic molecule
Emp. Form.C20H21N7O3S2
Mol. Mass.471.556
SMILESCNc1nc(C)c(s1)-c1nc(Nc2ccc(cc2)S(=O)(=O)N2CCOCC2)ncc1C#N