Reaction Details
TargetLysosomal alpha-glucosidase
LigandBDBM50425174
Substrate/Competitorn/a
Meas. Tech.ChEMBL_936870 (CHEMBL2320752)
IC50 21050±n/a nM
Citation Patil, VSNandre, KPGhosh, SRao, VJChopade, BASridhar, BBhosale, SVBhosale, SV Synthesis, crystal structure and antidiabetic activity of substituted (E)-3-(Benzo [d]thiazol-2-ylamino) phenylprop-2-en-1-one. Eur J Med Chem59:304-9 (2013) 
 
Lysosomal alpha-glucosidase
Name:Lysosomal alpha-glucosidase
Type:PROTEIN
Mol. Mass.:105312.45
Organism:Homo sapiens (Human)
Description:ChEMBL_1506060
Residue:952
BDBM50425174
NameBDBM50425174
Synonyms:CHEMBL2313592
TypeSmall organic molecule
Emp. Form.C18H16N2OS2
Mol. Mass.340.462
SMILESCSC(CC(=O)c1ccc(C)cc1)=Nc1nc2ccccc2s1