Reaction Details
TargetPancreatic alpha-amylase
LigandBDBM50425175
Substrate/Competitorn/a
Meas. Tech.ChEMBL_936874 (CHEMBL2320756)
IC50 18630±n/a nM
Citation Patil, VSNandre, KPGhosh, SRao, VJChopade, BASridhar, BBhosale, SVBhosale, SV Synthesis, crystal structure and antidiabetic activity of substituted (E)-3-(Benzo [d]thiazol-2-ylamino) phenylprop-2-en-1-one. Eur J Med Chem59:304-9 (2013) 
 
Pancreatic alpha-amylase
Name:Pancreatic alpha-amylase
Type:Protein
Mol. Mass.:57088.07
Organism:Sus scrofa (Pig)
Description:P00690
Residue:511
BDBM50425175
NameBDBM50425175
Synonyms:CHEMBL2313591
TypeSmall organic molecule
Emp. Form.C20H20N2O3S2
Mol. Mass.400.514
SMILESCCOc1ccc2nc(N=C(CC(=O)c3ccc(OC)cc3)SC)sc2c1