Reaction Details
TargetPancreatic alpha-amylase
LigandBDBM50425183
Substrate/Competitorn/a
Meas. Tech.ChEMBL_936874 (CHEMBL2320756)
IC50 15870±n/a nM
Citation Patil, VSNandre, KPGhosh, SRao, VJChopade, BASridhar, BBhosale, SVBhosale, SV Synthesis, crystal structure and antidiabetic activity of substituted (E)-3-(Benzo [d]thiazol-2-ylamino) phenylprop-2-en-1-one. Eur J Med Chem59:304-9 (2013) 
 
Pancreatic alpha-amylase
Name:Pancreatic alpha-amylase
Type:Protein
Mol. Mass.:57088.07
Organism:Sus scrofa (Pig)
Description:P00690
Residue:511
BDBM50425183
NameBDBM50425183
Synonyms:CHEMBL2313583
TypeSmall organic molecule
Emp. Form.C19H17BrN2O2S2
Mol. Mass.449.384
SMILESCCOc1ccc2nc(N=C(CC(=O)c3ccc(Br)cc3)SC)sc2c1