Reaction Details
TargetSodium-dependent serotonin transporter
LigandBDBM50073436
Substrate/Competitorn/a
Meas. Tech.ChEMBL_937749 (CHEMBL2318003)
Ki 0.100000±n/a nM
Citation Zheng, PLieberman, BPPloessl, KLemoine, LMiller, SKung, HF A new single-photon emission computed tomography (SPECT) imaging agent for serotonin transporters: [(125)I]Flip-IDAM, (2-((2-((dimethylamino)methyl)-4-iodophenyl)thio)phenyl)methanol. Bioorg Med Chem Lett23:869-72 (2013) 
 
Sodium-dependent serotonin transporter
Name:Sodium-dependent serotonin transporter
Type:Multi-pass membrane protein
Mol. Mass.:70322.51
Organism:Homo sapiens (Human)
Description:P31645
Residue:630
BDBM50073436
NameBDBM50073436
Synonyms:(2-(2-((dimethylamino)methyl)phenylthio)-5-iodophenyl)methanol CHEMBL2314219 | [2-(2-Dimethylaminomethyl-phenylsulfanyl)-5-iodo-phenyl]-methanol
TypeSmall organic molecule
Emp. Form.C16H18INOS
Mol. Mass.399.29
SMILESCN(C)Cc1ccccc1Sc1ccc(I)cc1CO