Reaction Details
TargetMitogen-activated protein kinase 14
LigandBDBM50425349
Substrate/Competitorn/a
Meas. Tech.ChEMBL_933871 (CHEMBL2317232)
IC50 2.0±n/a nM
Citation Fischer, SWentsch, HKMayer-Wrangowski, SCZimmermann, MBauer, SMStorch, KNiess, RKoeberle, SCGrütter, CBoeckler, FMRauh, DLaufer, SA Dibenzosuberones as p38 mitogen-activated protein kinase inhibitors with low ATP competitiveness and outstanding whole blood activity. J Med Chem56:241-53 (2013) 
 
Mitogen-activated protein kinase 14
Name:Mitogen-activated protein kinase 14
Type:Serine/threonine-protein kinase
Mol. Mass.:41286.76
Organism:Homo sapiens (Human)
Description:Q16539
Residue:360
BDBM50425349
NameBDBM50425349
Synonyms:CHEMBL2316492
TypeSmall organic molecule
Emp. Form.C32H29FN2O5S
Mol. Mass.572.646
SMILESCC1(C)OC[C@H](COc2ccc3CCc4cc(Nc5ccc(F)c(NC(=O)c6cccs6)c5)ccc4C(=O)c3c2)O1