Reaction Details
TargetMitogen-activated protein kinase 14
LigandBDBM50425359
Substrate/Competitorn/a
Meas. Tech.ChEMBL_933870 (CHEMBL2317231)
IC50 26±n/a nM
Citation Fischer, SWentsch, HKMayer-Wrangowski, SCZimmermann, MBauer, SMStorch, KNiess, RKoeberle, SCGrütter, CBoeckler, FMRauh, DLaufer, SA Dibenzosuberones as p38 mitogen-activated protein kinase inhibitors with low ATP competitiveness and outstanding whole blood activity. J Med Chem56:241-53 (2013) 
 
Mitogen-activated protein kinase 14
Name:Mitogen-activated protein kinase 14
Type:Serine/threonine-protein kinase
Mol. Mass.:41286.76
Organism:Homo sapiens (Human)
Description:Q16539
Residue:360
BDBM50425359
NameBDBM50425359
Synonyms:CHEMBL2316490
TypeSmall organic molecule
Emp. Form.C32H30FN3O4S
Mol. Mass.571.662
SMILESFc1ccc(Nc2ccc3c(CCc4ccc(OCCN5CCOCC5)cc4C3=O)c2)cc1NC(=O)c1ccsc1