Reaction Details
TargetTyrosine-protein kinase Lck
LigandBDBM50425385
Substrate/Competitorn/a
Meas. Tech.ChEMBL_934838 (CHEMBL2319491)
IC50 11050±n/a nM
Citation Duveau, DYHu, XWalsh, MJShukla, SSkoumbourdis, APBoxer, MBAmbudkar, SVShen, MThomas, CJ Synthesis and biological evaluation of analogues of the kinase inhibitor nilotinib as Abl and Kit inhibitors. Bioorg Med Chem Lett23:682-6 (2013) 
 
Tyrosine-protein kinase Lck
Name:Tyrosine-protein kinase Lck
Type:n/a
Mol. Mass.:57987.83
Organism:Homo sapiens (Human)
Description:P06239
Residue:509
BDBM50425385
NameBDBM50425385
Synonyms:CHEMBL2311807
TypeSmall organic molecule
Emp. Form.C27H22FN7O
Mol. Mass.479.5083
SMILESCc1cn(cn1)-c1cc(F)cc(NC(=O)c2ccc(C)c(Nc3nccc(n3)-c3cccnc3)c2)c1