Reaction Details
TargetAmine oxidase [flavin-containing] B
LigandBDBM50041581
Substrate/Competitorn/a
Meas. Tech.ChEMBL_935779 (CHEMBL2317359)
IC50 1580±n/a nM
Citation Rivara, SPiersanti, GBartoccini, FDiamantini, GPala, DRiccioni, TStasi, MACabri, WBorsini, FMor, MTarzia, GMinetti, P Synthesis of (E)-8-(3-chlorostyryl)caffeine analogues leading to 9-deazaxanthine derivatives as dual A(2A) antagonists/MAO-B inhibitors. J Med Chem56:1247-61 (2013) 
 
Amine oxidase [flavin-containing] B
Name:Amine oxidase [flavin-containing] B
Type:Protein
Mol. Mass.:58768.76
Organism:Homo sapiens (Human)
Description:P27338
Residue:520
BDBM50041581
NameBDBM50041581
Synonyms:1,3,5-Trimethyl-6-((E)-styryl)-1,5-dihydro-pyrrolo[3,2-d]pyrimidine-2,4-dione | CHEMBL39898
TypeSmall organic molecule
Emp. Form.C17H17N3O2
Mol. Mass.295.3358
SMILESCn1c(\C=C\c2ccccc2)cc2n(C)c(=O)n(C)c(=O)c12