Reaction Details
TargetAdenosine receptor A2a
LigandBDBM50425479
Substrate/Competitorn/a
Meas. Tech.ChEMBL_935780 (CHEMBL2317360)
Ki 94±n/a nM
Citation Rivara, SPiersanti, GBartoccini, FDiamantini, GPala, DRiccioni, TStasi, MACabri, WBorsini, FMor, MTarzia, GMinetti, P Synthesis of (E)-8-(3-chlorostyryl)caffeine analogues leading to 9-deazaxanthine derivatives as dual A(2A) antagonists/MAO-B inhibitors. J Med Chem56:1247-61 (2013) 
 
Adenosine receptor A2a
Name:Adenosine receptor A2a
Type:G Protein-Coupled Receptor (GPCR)
Mol. Mass.:44716.46
Organism:Homo sapiens (Human)
Description:P29274
Residue:412
BDBM50425479
NameBDBM50425479
Synonyms:CHEMBL2313277
TypeSmall organic molecule
Emp. Form.C19H19N3O3
Mol. Mass.337.3725
SMILESCC(=O)c1ccc(\C=C\c2cc3n(C)c(=O)n(C)c(=O)c3n2C)cc1