Reaction Details
TargetCoagulation factor XII
LigandBDBM50425648
Substrate/Competitorn/a
Meas. Tech.ChEMBL_937458 (CHEMBL2320206)
Ki>20000±n/a nM
Citation Saupe, SMLeubner, SBetz, MKlebe, GSteinmetzer, T Development of new cyclic plasmin inhibitors with excellent potency and selectivity. J Med Chem56:820-31 (2013) 
 
Coagulation factor XII
Name:Coagulation factor XII
Type:Enzyme
Mol. Mass.:67810.07
Organism:Homo sapiens (Human)
Description:P00748
Residue:615
BDBM50425648
NameBDBM50425648
Synonyms:CHEMBL2315243
TypeSmall organic molecule
Emp. Form.C43H51N9O6S
Mol. Mass.821.987
SMILESNC(=N)c1ccc(CNC(=O)[C@@H]2Cc3ccc(NC(=O)CCN4CCN(CC4)CCC(=O)Nc4ccc(C[C@@H](NS(=O)(=O)Cc5ccccc5)C(=O)N2)cc4)cc3)cc1