Reaction Details
TargetComplement C1r subcomponent
LigandBDBM50425649
Substrate/Competitorn/a
Meas. Tech.ChEMBL_937460 (CHEMBL2320208)
Ki>50000±n/a nM
Citation Saupe, SMLeubner, SBetz, MKlebe, GSteinmetzer, T Development of new cyclic plasmin inhibitors with excellent potency and selectivity. J Med Chem56:820-31 (2013) 
 
Complement C1r subcomponent
Name:Complement C1r subcomponent
Type:Enzyme
Mol. Mass.:80113.65
Organism:Homo sapiens (Human)
Description:P00736
Residue:705
BDBM50425649
NameBDBM50425649
Synonyms:CHEMBL2315239
TypeSmall organic molecule
Emp. Form.C41H47N9O6S
Mol. Mass.793.934
SMILESNC(=N)c1ccc(CNC(=O)[C@@H]2Cc3ccc(NC(=O)CN4CCN(CC4)CC(=O)Nc4ccc(C[C@@H](NS(=O)(=O)Cc5ccccc5)C(=O)N2)cc4)cc3)cc1