Reaction Details
TargetVitamin K-dependent protein C
LigandBDBM50425661
Substrate/Competitorn/a
Meas. Tech.ChEMBL_937463 (CHEMBL2320211)
Ki 39±n/a nM
Citation Saupe, SMLeubner, SBetz, MKlebe, GSteinmetzer, T Development of new cyclic plasmin inhibitors with excellent potency and selectivity. J Med Chem56:820-31 (2013) 
 
Vitamin K-dependent protein C
Name:Vitamin K-dependent protein C
Type:Enzyme
Mol. Mass.:52067.73
Organism:Homo sapiens (Human)
Description:n/a
Residue:461
BDBM50425661
NameBDBM50425661
Synonyms:CHEMBL2315240
TypeSmall organic molecule
Emp. Form.C41H47N9O6S
Mol. Mass.793.934
SMILESNC(=N)c1ccc(CNC(=O)[C@@H]2Cc3cccc(NC(=O)CN4CCN(CC4)CC(=O)Nc4cccc(C[C@@H](NS(=O)(=O)Cc5ccccc5)C(=O)N2)c4)c3)cc1