Reaction Details
TargetCoagulation factor X
LigandBDBM50425651
Substrate/Competitorn/a
Meas. Tech.ChEMBL_937468 (CHEMBL2320216)
Ki 3700±n/a nM
Citation Saupe, SMLeubner, SBetz, MKlebe, GSteinmetzer, T Development of new cyclic plasmin inhibitors with excellent potency and selectivity. J Med Chem56:820-31 (2013) 
 
Coagulation factor X
Name:Coagulation factor X
Type:Enzyme
Mol. Mass.:54726.60
Organism:Homo sapiens (Human)
Description:n/a
Residue:488
BDBM50425651
NameBDBM50425651
Synonyms:CHEMBL2315235
TypeSmall organic molecule
Emp. Form.C43H51N9O6S
Mol. Mass.821.987
SMILESC[C@H]1CN2CC(=O)Nc3ccc(C[C@@H](NS(=O)(=O)Cc4ccccc4)C(=O)N[C@@H](Cc4ccc(NC(=O)CN1C[C@@H]2C)cc4)C(=O)NCc1ccc(cc1)C(N)=N)cc3