Reaction Details
TargetProthrombin
LigandBDBM50425656
Substrate/Competitorn/a
Meas. Tech.ChEMBL_937464 (CHEMBL2320212)
Ki 14143±n/a nM
Citation Saupe, SMLeubner, SBetz, MKlebe, GSteinmetzer, T Development of new cyclic plasmin inhibitors with excellent potency and selectivity. J Med Chem56:820-31 (2013) 
 
Prothrombin
Name:Prothrombin
Type:Protein
Mol. Mass.:70029.57
Organism:Homo sapiens (Human)
Description:P00734
Residue:622
BDBM50425656
NameBDBM50425656
Synonyms:CHEMBL2315246
TypeSmall organic molecule
Emp. Form.C42H49N9O6S
Mol. Mass.807.96
SMILESNC(=N)c1ccc(CNC(=O)[C@@H]2Cc3ccc(NC(=O)CN4CCCN(CC4)CC(=O)Nc4ccc(C[C@@H](NS(=O)(=O)Cc5ccccc5)C(=O)N2)cc4)cc3)cc1