Reaction Details
TargetPlasma kallikrein
LigandBDBM50425661
Substrate/Competitorn/a
Meas. Tech.ChEMBL_937466 (CHEMBL2320214)
Ki 3.2±n/a nM
Citation Saupe, SMLeubner, SBetz, MKlebe, GSteinmetzer, T Development of new cyclic plasmin inhibitors with excellent potency and selectivity. J Med Chem56:820-31 (2013) 
 
Plasma kallikrein
Name:Plasma kallikrein
Type:Protein
Mol. Mass.:71391.16
Organism:Homo sapiens (Human)
Description:P03952
Residue:638
BDBM50425661
NameBDBM50425661
Synonyms:CHEMBL2315240
TypeSmall organic molecule
Emp. Form.C41H47N9O6S
Mol. Mass.793.934
SMILESNC(=N)c1ccc(CNC(=O)[C@@H]2Cc3cccc(NC(=O)CN4CCN(CC4)CC(=O)Nc4cccc(C[C@@H](NS(=O)(=O)Cc5ccccc5)C(=O)N2)c4)c3)cc1