Reaction Details
TargetPlasminogen
LigandBDBM50425652
Substrate/Competitorn/a
Meas. Tech.ChEMBL_937467 (CHEMBL2320215)
Ki 1.2±n/a nM
Citation Saupe, SMLeubner, SBetz, MKlebe, GSteinmetzer, T Development of new cyclic plasmin inhibitors with excellent potency and selectivity. J Med Chem56:820-31 (2013) 
 
Plasminogen
Name:Plasminogen
Type:Enzyme
Mol. Mass.:90579.18
Organism:Homo sapiens (Human)
Description:n/a
Residue:810
BDBM50425652
NameBDBM50425652
Synonyms:CHEMBL2315234
TypeSmall organic molecule
Emp. Form.C43H51N9O6S
Mol. Mass.821.987
SMILESC[C@H]1CN2CC(=O)Nc3ccc(C[C@@H](NS(=O)(=O)Cc4ccccc4)C(=O)N[C@@H](Cc4ccc(NC(=O)CN1C[C@H]2C)cc4)C(=O)NCc1ccc(cc1)C(N)=N)cc3