Reaction Details
TargetAndrogen receptor
LigandBDBM50425734
Substrate/Competitorn/a
Meas. Tech.ChEMBL_933429 (CHEMBL2318841)
IC50 2700±n/a nM
Citation Munuganti, RSLeblanc, EAxerio-Cilies, PLabriere, CFrewin, KSingh, KHassona, MDLack, NALi, HBan, FTomlinson Guns, EYoung, RRennie, PSCherkasov, A Targeting the binding function 3 (BF3) site of the androgen receptor through virtual screening. 2. development of 2-((2-phenoxyethyl) thio)-1H-benzimidazole derivatives. J Med Chem56:1136-48 (2013) 
 
Androgen receptor
Name:Androgen receptor
Type:Receptor
Mol. Mass.:99185.27
Organism:Homo sapiens (Human)
Description:CHO cells were stably transfected with human AR gene.
Residue:920
BDBM50425734
NameBDBM50425734
Synonyms:CHEMBL2316542
TypeSmall organic molecule
Emp. Form.C17H18N2OS
Mol. Mass.298.403
SMILESCc1cccc(C)c1OCCSc1nc2ccccc2[nH]1