Reaction Details
TargetPoly [ADP-ribose] polymerase tankyrase-2
LigandBDBM50318567
Substrate/Competitorn/a
Meas. Tech.ChEMBL_934569 (CHEMBL2317530)
IC50 17±n/a nM
Citation Bregman, HGunaydin, HGu, YSchneider, SWilson, CDiMauro, EFHuang, X Discovery of a class of novel tankyrase inhibitors that bind to both the nicotinamide pocket and the induced pocket. J Med Chem56:1341-5 (2013) 
 
Poly [ADP-ribose] polymerase tankyrase-2
Name:Poly [ADP-ribose] polymerase tankyrase-2
Type:Enzyme
Mol. Mass.:126937.16
Organism:Homo sapiens (Human)
Description:Q9H2K2
Residue:1166
BDBM50318567
NameBDBM50318567
Synonyms:2-(4-(Trifluoromethyl)phenyl)-7,8-dihydro-5H-thiopyrano-[4,3-d]pyrimidin-4-ol CHEMBL1086580
TypeSmall organic molecule
Emp. Form.C14H11F3N2OS
Mol. Mass.312.31
SMILESFC(F)(F)c1ccc(cc1)-c1nc2CCSCc2c(=O)[nH]1