Reaction Details
TargetMuscarinic acetylcholine receptor M5
LigandBDBM50368127
Substrate/Competitorn/a
Meas. Tech.ChEMBL_936414 (CHEMBL2317407)
Ki 18±n/a nM
Citation Zheng, GSmith, AMHuang, XSubramanian, KLSiripurapu, KBDeaciuc, AZhan, CGDwoskin, LP Structural modifications to tetrahydropyridine-3-carboxylate esters en route to the discovery of M5-preferring muscarinic receptor orthosteric antagonists. J Med Chem56:1693-703 (2013) 
 
Muscarinic acetylcholine receptor M5
Name:Muscarinic acetylcholine receptor M5
Type:PROTEIN
Mol. Mass.:60102.35
Organism:Homo sapiens (Human)
Description:ChEMBL_1517990
Residue:532
BDBM50368127
NameBDBM50368127
Synonyms:Isoptpo Hyoscine | SCOPOLAMINE
TypeSmall organic molecule
Emp. Form.C17H21NO4
Mol. Mass.303.3529
SMILESCN1[C@H]2CC(C[C@H]1[C@@H]1O[C@@H]21)OC(=O)[C@H](CO)c1ccccc1