Reaction Details
TargetMuscarinic acetylcholine receptor M5
LigandBDBM39341
Substrate/Competitorn/a
Meas. Tech.ChEMBL_936424 (CHEMBL2317633)
Ki 126±n/a nM
Citation Zheng, GSmith, AMHuang, XSubramanian, KLSiripurapu, KBDeaciuc, AZhan, CGDwoskin, LP Structural modifications to tetrahydropyridine-3-carboxylate esters en route to the discovery of M5-preferring muscarinic receptor orthosteric antagonists. J Med Chem56:1693-703 (2013) 
 
Muscarinic acetylcholine receptor M5
Name:Muscarinic acetylcholine receptor M5
Type:PROTEIN
Mol. Mass.:60102.35
Organism:Homo sapiens (Human)
Description:ChEMBL_1517990
Residue:532
BDBM39341
NameBDBM39341
Synonyms:11-[(4-methylpiperazin-1-yl)acetyl]-5,11-dihydro-6H-pyrido[2,3-b][1,4]benzodiazepin-6-one 11-[2-(4-methylpiperazin-1-yl)acetyl]-5H-pyrido[2,3-b][1,4]benzodiazepin-6-one;hydrochloride 11-[2-(4-methylpiperazino)acetyl]-5H-pyrido[2,3-b][1,4]benzodiazepin-6-one;hydrochloride MLS000069702 PIRENZEPINE DIHYDROCHLORIDE cid_185248
TypeSmall organic molecule
Emp. Form.C19H21N5O2
Mol. Mass.351.4023
SMILESCN1CCN(CC(=O)N2c3ccccc3C(=O)Nc3cccnc23)CC1