Reaction Details
TargetcAMP-specific 3',5'-cyclic phosphodiesterase 4A
LigandBDBM50426300
Substrate/Competitorn/a
Meas. Tech.ChEMBL_936451 (CHEMBL2317660)
IC50 1460000±n/a nM
Citation Wei, LWasilewski, EChakka, SKBello, AMMoscarello, MAKotra, LP Novel inhibitors of protein arginine deiminase with potential activity in multiple sclerosis animal model. J Med Chem56:1715-22 (2013) 
 
cAMP-specific 3',5'-cyclic phosphodiesterase 4A
Name:cAMP-specific 3',5'-cyclic phosphodiesterase 4A
Type:Enzyme
Mol. Mass.:98113.27
Organism:Homo sapiens (Human)
Description:P27815
Residue:886
BDBM50426300
NameBDBM50426300
Synonyms:CHEMBL2312699
TypeSmall organic molecule
Emp. Form.C11H21N4
Mol. Mass.209.3107
SMILES[#6]-[#6](=[#7]\[#7+]=[#6](\[#7])-[#7])-[#6]-1=[#6]C([#6])([#6])[#6]-[#6]-[#6]-1