Reaction Details
TargetcAMP-specific 3',5'-cyclic phosphodiesterase 4A
LigandBDBM50426303
Substrate/Competitorn/a
Meas. Tech.ChEMBL_936451 (CHEMBL2317660)
IC50 1320000±n/a nM
Citation Wei, LWasilewski, EChakka, SKBello, AMMoscarello, MAKotra, LP Novel inhibitors of protein arginine deiminase with potential activity in multiple sclerosis animal model. J Med Chem56:1715-22 (2013) 
 
cAMP-specific 3',5'-cyclic phosphodiesterase 4A
Name:cAMP-specific 3',5'-cyclic phosphodiesterase 4A
Type:Enzyme
Mol. Mass.:98113.27
Organism:Homo sapiens (Human)
Description:P27815
Residue:886
BDBM50426303
NameBDBM50426303
Synonyms:CHEMBL2312697
TypeSmall organic molecule
Emp. Form.C13H13N5OS
Mol. Mass.287.34
SMILES[#6]-[#6@H]-1-[#6](=O)-[#7]-c2ccc(cc-12)-c1csc(\[#7]=[#6](\[#7])-[#7])n1