Reaction Details
TargetcAMP-specific 3',5'-cyclic phosphodiesterase 4A
LigandBDBM50266539
Substrate/Competitorn/a
Meas. Tech.ChEMBL_936452 (CHEMBL2317661)
IC50 100000±n/a nM
Citation Wei, LWasilewski, EChakka, SKBello, AMMoscarello, MAKotra, LP Novel inhibitors of protein arginine deiminase with potential activity in multiple sclerosis animal model. J Med Chem56:1715-22 (2013) 
 
cAMP-specific 3',5'-cyclic phosphodiesterase 4A
Name:cAMP-specific 3',5'-cyclic phosphodiesterase 4A
Type:Enzyme
Mol. Mass.:98113.27
Organism:Homo sapiens (Human)
Description:P27815
Residue:886
BDBM50266539
NameBDBM50266539
Synonyms:(4S,4aS,5aS,6S,12aS)-7-chloro-4-(dimethylamino)-3,6,10,12,12a-pentahydroxy-6-methyl-1,11-dioxo-1,4,4a,5,5a,6,11,12a-octahydrotetracene-2-carboxamide CHLORTETRACYCLINE | chlorotetracycline
TypeSmall organic molecule
Emp. Form.C22H23ClN2O8
Mol. Mass.478.88
SMILESCN(C)[C@H]1[C@@H]2C[C@H]3C(C(=O)c4c(O)ccc(Cl)c4[C@@]3(C)O)C(=O)[C@]2(O)C(=O)C(C(N)=O)C1=O