Reaction Details
TargetFatty acid synthase
LigandBDBM50426427
Substrate/Competitorn/a
Meas. Tech.ChEMBL_940339 (CHEMBL2328957)
IC50 50±n/a nM
Citation Oslob, JDJohnson, RJCai, HFeng, SQHu, LKosaka, YLai, JSivaraja, MTep, SYang, HZaharia, CAEvanchik, MJMcDowell, RS Imidazopyridine-Based Fatty Acid Synthase Inhibitors That Show Anti-HCV Activity and in Vivo Target Modulation. ACS Med Chem Lett4:113-7 (2013) 
 
Fatty acid synthase
Name:Fatty acid synthase
Type:Enzyme
Mol. Mass.:273419.37
Organism:Homo sapiens (Human)
Description:P49327
Residue:2511
BDBM50426427
NameBDBM50426427
Synonyms:CHEMBL2322357
TypeSmall organic molecule
Emp. Form.C30H31N5O2
Mol. Mass.493.5994
SMILESCc1ccc(cc1NC(=O)c1ccc(nc1)N1CCCC1)C(=O)N1CCC(CC1)c1ccc(cc1)C#N